Target
Delta-type opioid receptor
Ligand
BDBM50026763
Substrate
Meas. Tech.
ChEMBL_1437486 (CHEMBL3387857)
EC50
360±n/a nM
Citation
 Mollica, ACarotenuto, ANovellino, ELimatola, ACostante, RPinnen, FStefanucci, APieretti, SBorsodi, ASamavati, RZador, FBenyhe, SDavis, PPorreca, FHruby, VJ Novel cyclic biphalin analogue with improved antinociceptive properties. ACS Med Chem Lett 5:1032-6 (2014)  
Target
Name:
Delta-type opioid receptor
Synonyms:
DOR-1 MSL-2 OPRD_MOUSE Oprd1
Type:
Enzyme Catalytic Domain
Mol. Mass.:
40577.25
Organism:
MOUSE
Description:
P32300
Residue:
372
  
Inhibitor
Name:
BDBM50026763
Synonyms:
CHEMBL3331511
Type:
Small organic molecule
Emp. Form.:
C50H62N10O10S2
Mol. Mass.:
1027.218
SMILES:
CC1(C)SSC(C)(C)[C@H](NC(=O)[C@@H](N)Cc2ccc(O)cc2)C(=O)NCC(=O)N[C@@H](Cc2ccccc2)C(=O)NNC(=O)[C@H](Cc2ccccc2)NC(=O)CNC(=O)[C@H]1NC(=O)[C@@H](N)Cc1ccc(O)cc1
: