Target
D(2) dopamine receptor
Ligand
BDBM50027072
Substrate
Meas. Tech.
ChEMBL_1439003 (CHEMBL3383110)
IC50
>100000±n/a nM
Citation
 Berry, CBBubser, MJones, CKHayes, JPWepy, JALocuson, CWDaniels, JSLindsley, CWHopkins, CR Discovery and Characterization of ML398, a Potent and Selective Antagonist of the D4 Receptor with in Vivo Activity. ACS Med Chem Lett 5:1060-4 (2014)  
Target
Name:
D(2) dopamine receptor
Synonyms:
D(2) dopamine receptor DOPAMINE D2 Long DRD2 Dopamine D2 receptor Dopamine D2 receptor (D2R) Dopamine2-like | d2
Type:
Cell-surface receptors
Mol. Mass.:
50647.10
Organism:
Homo sapiens (Human)
Description:
P14416
Residue:
443
  
Inhibitor
Name:
BDBM50027072
Synonyms:
CHEMBL3335535
Type:
Small organic molecule
Emp. Form.:
C20H23N3O
Mol. Mass.:
321.4161
SMILES:
C(Cc1ccccc1)C1CN(Cc2nc3ccccc3[nH]2)CCO1
: