Target
Folate receptor alpha
Ligand
BDBM50027658
Substrate
Meas. Tech.
ChEMBL_1431346 (CHEMBL3387472)
IC50
>1000±n/a nM
Citation
 Golani, LKGeorge, CZhao, SRaghavan, SOrr, SWallace, AWilson, MRHou, ZMatherly, LHGangjee, A Structure-activity profiles of novel 6-substituted pyrrolo[2,3-d]pyrimidine thienoyl antifolates with modified amino acids for cellular uptake by folate receptorsa andß and the proton-coupled folate transporter. J Med Chem 57:8152-66 (2014)  
Target
Name:
Folate receptor alpha
Synonyms:
Adult folate-binding protein FOLR FOLR1_HUMAN Folate receptor 1 KB cells FBP | Ovarian tumor-associated antigen MOv18
Type:
PROTEIN
Mol. Mass.:
29827.41
Organism:
Homo sapiens (Human)
Description:
ChEMBL_1469596
Residue:
257
  
Inhibitor
Name:
BDBM50027658
Synonyms:
CHEMBL3335606
Type:
Small organic molecule
Emp. Form.:
C18H21N5O4S
Mol. Mass.:
403.455
SMILES:
Nc1nc2[nH]c(CCCc3ccc(s3)C(=O)NCCCC(O)=O)cc2c(=O)[nH]1
: