Target
Carbonic anhydrase 9
Ligand
BDBM50028268
Substrate
Meas. Tech.
ChEMBL_1436192 (CHEMBL3386554)
Ki
2.0±n/a nM
Citation
 Moeker, JMahon, BPBornaghi, LFVullo, DSupuran, CTMcKenna, RPoulsen, SA Structural insights into carbonic anhydrase IX isoform specificity of carbohydrate-based sulfamates. J Med Chem 57:8635-45 (2014)  
Target
Name:
Carbonic anhydrase 9
Synonyms:
CA-IX CAH9_HUMAN Carbonic anhydrase 9 (CA IX) Carbonic anhydrase 9 precursor Carbonic anhydrase IX (CAIX) Carbonic anhydrases; II & IX MN RCC-associated antigen G250
Type:
Enzyme
Mol. Mass.:
49669.03
Organism:
Homo sapiens (Human)
Description:
Catalytic domain of human cloned isozyme was used in the assay
Residue:
459
  
Inhibitor
Name:
BDBM50028268
Synonyms:
CHEMBL3342249
Type:
Small organic molecule
Emp. Form.:
C20H34N2O14S2
Mol. Mass.:
590.619
SMILES:
CC(=O)OC[C@H]1O[C@H]([C@H](OC(C)=O)[C@@H](OC(C)=O)[C@@H]1OC(C)=O)S(=O)(=O)NCCCCCCOS(N)(=O)=O
: