Target
Bile acid receptor
Ligand
BDBM21675
Substrate
Meas. Tech.
ChEMBL_1436929 (CHEMBL3388427)
EC50
99000±n/a nM
Citation
 Merk, DLamers, CAhmad, KCarrasco Gomez, RSchneider, GSteinhilber, DSchubert-Zsilavecz, M Extending the structure-activity relationship of anthranilic acid derivatives as farnesoid X receptor modulators: development of a highly potent partial farnesoid X receptor agonist. J Med Chem 57:8035-55 (2014)  
Target
Name:
Bile acid receptor
Synonyms:
BAR FXR HRR1 NR1H4_HUMAN RIP14 Retinoid X receptor-interacting protein 14 | farnesoid x receptor
Type:
Nuclear Receptor
Mol. Mass.:
55916.24
Organism:
Homo sapiens (Human)
Description:
Q96RI1
Residue:
486
  
Inhibitor
Name:
BDBM21675
Synonyms:
(4R)-4-[(1S,2S,5R,7S,8R,9R,10S,11S,14R,15R)-8-ethyl-5,9-dihydroxy-2,15-dimethyltetracyclo[8.7.0.0^{2,7}.0^{11,15}]heptadecan-14-yl]pentanoic acid 6-ethyl chenodeoxycholic acid 6ECDCA INT-747 Ocaliva US10266560, Example 6-ECDCA obeticholic acid
Type:
Steroid
Emp. Form.:
C26H44O4
Mol. Mass.:
420.6252
SMILES:
[H][C@@]1(CC[C@@]2([H])[C@]3([H])[C@H](O)[C@H](CC)[C@]4([H])C[C@H](O)CC[C@]4(C)[C@@]3([H])CC[C@]12C)[C@H](C)CCC(O)=O
: