Target
ATP-dependent Clp protease proteolytic subunit
Ligand
BDBM50028481
Substrate
Meas. Tech.
ChEMBL_1437605 (CHEMBL3390207)
Kd
700±n/a nM
Citation
 Goodreid, JDWong, KLeung, EMcCaw, SEGray-Owen, SDLough, AHoury, WABatey, RA Total synthesis and antibacterial testing of the A54556 cyclic acyldepsipeptides isolated from Streptomyces hawaiiensis. J Nat Prod 77:2170-81 (2014)  
Target
Name:
ATP-dependent Clp protease proteolytic subunit
Synonyms:
ATP-dependent Clp protease proteolytic subunit Caseinolytic protease Heat shock protein F21.5 Protease Ti lopP
Type:
PROTEIN
Mol. Mass.:
23183.39
Organism:
Escherichia coli (strain K12)
Description:
ChEMBL_109492
Residue:
207
  
Inhibitor
Name:
BDBM50028481
Synonyms:
CHEMBL3342325
Type:
Small organic molecule
Emp. Form.:
C37H48N6O8
Mol. Mass.:
704.8124
SMILES:
[H][C@@]12CCCN1C(=O)[C@H](C)NC(=O)[C@H](C)N(C)C(=O)[C@]1([H])CCCN1C(=O)[C@H](COC2=O)NC(=O)[C@H](Cc1ccccc1)NC(=O)\C=C\C=C\C=C\C
: