Target
Neuraminidase
Ligand
BDBM50028501
Substrate
Meas. Tech.
ChEMBL_1437608 (CHEMBL3390210)
IC50
>3000±n/a nM
Citation
 Xie, YXu, DHuang, BMa, XQi, WShi, FLiu, XZhang, YXu, W Discovery of N-substituted oseltamivir derivatives as potent and selective inhibitors of H5N1 influenza neuraminidase. J Med Chem 57:8445-58 (2014)  
Target
Name:
Neuraminidase
Synonyms:
NA Neuraminidase
Type:
PROTEIN
Mol. Mass.:
51863.92
Organism:
Influenza A virus (strain A/USSR/90/1977 H1N1)
Description:
ChEMBL_109720
Residue:
470
  
Inhibitor
Name:
BDBM50028501
Synonyms:
CHEMBL3342465
Type:
Small organic molecule
Emp. Form.:
C21H38N4O4
Mol. Mass.:
410.5508
SMILES:
CCC(CC)CN([C@H]1CC(=C[C@@H](OC(CC)CC)[C@@H]1NC(C)=O)C(O)=O)C(N)=N
: