Target
Neuraminidase
Ligand
BDBM50028502
Substrate
Meas. Tech.
ChEMBL_1437608 (CHEMBL3390210)
IC50
>3000±n/a nM
Citation
 Xie, YXu, DHuang, BMa, XQi, WShi, FLiu, XZhang, YXu, W Discovery of N-substituted oseltamivir derivatives as potent and selective inhibitors of H5N1 influenza neuraminidase. J Med Chem 57:8445-58 (2014)  
Target
Name:
Neuraminidase
Synonyms:
NA Neuraminidase
Type:
PROTEIN
Mol. Mass.:
51863.92
Organism:
Influenza A virus (strain A/USSR/90/1977 H1N1)
Description:
ChEMBL_109720
Residue:
470
  
Inhibitor
Name:
BDBM50028502
Synonyms:
CHEMBL3342466
Type:
Small organic molecule
Emp. Form.:
C24H36N4O4
Mol. Mass.:
444.567
SMILES:
CCC(CC)O[C@@H]1C=C(C[C@@H]([C@H]1NC(C)=O)N(CCCc1ccccc1)C(N)=N)C(O)=O
: