Target
Gamma-butyrobetaine dioxygenase
Ligand
BDBM50193145
Substrate
Meas. Tech.
ChEMBL_1434105 (CHEMBL3382783)
IC50
33000±n/a nM
Citation
 Rydzik, AMBrem, JStruwe, WBKochan, GTBenesch, JLSchofield, CJ Ejection of structural zinc leads to inhibition of¿-butyrobetaine hydroxylase. Bioorg Med Chem Lett 24:4954-7 (2014)  
Target
Name:
Gamma-butyrobetaine dioxygenase
Synonyms:
BBH BBOX1 Gamma-BBH Gamma-butyrobetaine,2-oxoglutarate dioxygenase
Type:
PROTEIN
Mol. Mass.:
44715.93
Organism:
Homo sapiens (Human)
Description:
ChEMBL_1434107
Residue:
387
  
Inhibitor
Name:
BDBM50193145
Synonyms:
2-(1-chloro-4-hydroxyisoquinoline-3-carboxamido)acetic acid Isoquinoline 3 | N-[(1-CHLORO-4-HYDROXYISOQUINOLIN-3-YL)CARBONYL]GLYCINE
Type:
Small organic molecule
Emp. Form.:
C12H9ClN2O4
Mol. Mass.:
280.664
SMILES:
OC(=O)CNC(=O)c1nc(Cl)c2ccccc2c1O
: