Target
Aurora kinase A
Ligand
BDBM50029356
Substrate
Meas. Tech.
ChEMBL_1436940 (CHEMBL3388438)
IC50
212±n/a nM
Citation
 Cai, JLi, LHong, KHWu, XChen, JWang, PCao, MZong, XJi, M Discovery of 4-aminoquinazoline--urea derivatives as Aurora kinase inhibitors with antiproliferative activity. Bioorg Med Chem 22:5813-23 (2014)  
Target
Name:
Aurora kinase A
Synonyms:
AIK ARK1 AURKA AYK1 Aurora kinase A (AURA) Aurora kinase A (Aurora A) Aurora-related kinase 1 BTAK Breast-tumor-amplified kinase STK15 Serine/threonine kinase 15 Serine/threonine-protein kinase aurora A hARK1
Type:
Serine/threonine-protein kinase
Mol. Mass.:
45830.98
Organism:
Homo sapiens (Human)
Description:
O14965
Residue:
403
  
Inhibitor
Name:
BDBM50029356
Synonyms:
CHEMBL3343308
Type:
Small organic molecule
Emp. Form.:
C29H32N6O3
Mol. Mass.:
512.6028
SMILES:
O=C(NCc1ccccc1)Nc1ccc(Nc2ncnc3cc(OCCCN4CCOCC4)ccc23)cc1
: