Target
Aurora kinase B
Ligand
BDBM50029356
Substrate
Meas. Tech.
ChEMBL_1436941 (CHEMBL3388439)
IC50
367±n/a nM
Citation
 Cai, JLi, LHong, KHWu, XChen, JWang, PCao, MZong, XJi, M Discovery of 4-aminoquinazoline--urea derivatives as Aurora kinase inhibitors with antiproliferative activity. Bioorg Med Chem 22:5813-23 (2014)  
Target
Name:
Aurora kinase B
Synonyms:
AIK2 AIM1 ARK2 AURKB_HUMAN Aurora B-INCENP Aurora kinase B (AURKB) STK-1 STK12 Serine/threonine-protein kinase aurora B
Type:
Protein
Mol. Mass.:
39327.72
Organism:
Homo sapiens (Human)
Description:
Q96GD4
Residue:
344
  
Inhibitor
Name:
BDBM50029356
Synonyms:
CHEMBL3343308
Type:
Small organic molecule
Emp. Form.:
C29H32N6O3
Mol. Mass.:
512.6028
SMILES:
O=C(NCc1ccccc1)Nc1ccc(Nc2ncnc3cc(OCCCN4CCOCC4)ccc23)cc1
: