Target
Aurora kinase B
Ligand
BDBM50029459
Substrate
Meas. Tech.
ChEMBL_1436941 (CHEMBL3388439)
IC50
156±n/a nM
Citation
 Cai, JLi, LHong, KHWu, XChen, JWang, PCao, MZong, XJi, M Discovery of 4-aminoquinazoline--urea derivatives as Aurora kinase inhibitors with antiproliferative activity. Bioorg Med Chem 22:5813-23 (2014)  
Target
Name:
Aurora kinase B
Synonyms:
AIK2 AIM1 ARK2 AURKB_HUMAN Aurora B-INCENP Aurora kinase B (AURKB) STK-1 STK12 Serine/threonine-protein kinase aurora B
Type:
Protein
Mol. Mass.:
39327.72
Organism:
Homo sapiens (Human)
Description:
Q96GD4
Residue:
344
  
Inhibitor
Name:
BDBM50029459
Synonyms:
CHEMBL3343420
Type:
Small organic molecule
Emp. Form.:
C29H33N5O4
Mol. Mass.:
515.6034
SMILES:
COC1=CC2C(C=C1OCCCN1CCOCC1)N=CN=C2Nc1ccc(NC(=O)c2ccccc2)cc1
: