Target
Insulin receptor
Ligand
BDBM50029668
Substrate
Meas. Tech.
ChEMBL_1437632 (CHEMBL3390234)
IC50
912±n/a nM
Citation
 Finlay, MRAnderton, MAshton, SBallard, PBethel, PABox, MRBradbury, RHBrown, SJButterworth, SCampbell, AChorley, CColclough, NCross, DACurrie, GSGrist, MHassall, LHill, GBJames, DJames, MKemmitt, PKlinowska, TLamont, GLamont, SGMartin, NMcFarland, HLMellor, MJOrme, JPPerkins, DPerkins, PRichmond, GSmith, PWard, RAWaring, MJWhittaker, DWells, SWrigley, GL Discovery of a potent and selective EGFR inhibitor (AZD9291) of both sensitizing and T790M resistance mutations that spares the wild type form of the receptor. J Med Chem 57:8249-67 (2014)  
Target
Name:
Insulin receptor
Synonyms:
INSR INSR_HUMAN Insulin receptor beta subunit
Type:
Receptor Tyrosine Kinase
Mol. Mass.:
156322.60
Organism:
Homo sapiens (Human)
Description:
P06213
Residue:
1382
  
Inhibitor
Name:
BDBM50029668
Synonyms:
AZD-9291 US10085983, Compound AZD-9291 US11111233, Example AZD9291 US9890168, Compound AZD-9291 | WO2022090481, Example osimertinib
Type:
Small organic molecule
Emp. Form.:
C28H33N7O2
Mol. Mass.:
499.6073
SMILES:
COc1cc(N(C)CCN(C)C)c(NC(=O)C=C)cc1Nc1nccc(n1)-c1cn(C)c2ccccc12
: