Target
Muscarinic acetylcholine receptor M2
Ligand
BDBM50030223
Substrate
Meas. Tech.
ChEMBL_1438414 (CHEMBL3383643)
Ki
1.4±n/a nM
Citation
 Bonifazi, AYano, HDel Bello, FFarande, AQuaglia, WPetrelli, RMatucci, RNesi, MVistoli, GFerré, SPiergentili, A Synthesis and biological evaluation of a novel series of heterobivalent muscarinic ligands based on xanomeline and 1-[3-(4-butylpiperidin-1-yl)propyl]-1,2,3,4-tetrahydroquinolin-2-one (77-LH-28-1). J Med Chem 57:9065-77 (2014)  
Target
Name:
Muscarinic acetylcholine receptor M2
Synonyms:
ACM2_HUMAN Cholinergic, muscarinic M2 Muscarinic acetylcholine receptor M2 and M5 | RecName: Full=Muscarinic acetylcholine receptor M2
Type:
GPCR
Mol. Mass.:
51730.61
Organism:
Homo sapiens (Human)
Description:
P08172
Residue:
466
  
Inhibitor
Name:
BDBM50030223
Synonyms:
CHEMBL3354068
Type:
Small organic molecule
Emp. Form.:
C32H47N5O2S
Mol. Mass.:
565.813
SMILES:
CN1CCC=C(C1)c1nsnc1OCCCCCCCC1CCN(CCCN2C(=O)CCc3ccccc23)CC1
: