Target
Bifunctional chorismate mutase/prephenate dehydratase
Ligand
BDBM96194
Substrate
Meas. Tech.
ChEMBL_1431488 (CHEMBL3389853)
IC50
30000±n/a nM
Citation
 Meneely, KMLuo, QRiley, APTaylor, BRoy, AStein, RLPrisinzano, TELamb, AL Expanding the results of a high throughput screen against an isochorismate-pyruvate lyase to enzymes of a similar scaffold or mechanism. Bioorg Med Chem 22:5961-9 (2014)  
Target
Name:
Bifunctional chorismate mutase/prephenate dehydratase
Synonyms:
CM Chorismate mutase P-protein Prephenate dehydratase | pheA
Type:
PROTEIN
Mol. Mass.:
43112.35
Organism:
Escherichia coli (strain K12)
Description:
ChEMBL_109500
Residue:
386
  
Inhibitor
Name:
BDBM96194
Synonyms:
5-[(2-carboxyphenyl)sulfamoyl]-2-hydroxy-benzoic acid 5-[(2-carboxyphenyl)sulfamoyl]-2-oxidanyl-benzoic acid SMR000054530 | cid_789790
Type:
Small organic molecule
Emp. Form.:
C14H11NO7S
Mol. Mass.:
337.305
SMILES:
OC(=O)c1ccccc1NS(=O)(=O)c1ccc(O)c(c1)C(O)=O
: