Target
Sortase family protein
Ligand
BDBM50201782
Substrate
Meas. Tech.
ChEMBL_1431503 (CHEMBL3389868)
IC50
16910±n/a nM
Citation
 Zhulenkovs, DRudevica, ZJaudzems, KTurks, MLeonchiks, A Discovery and structure-activity relationship studies of irreversible benzisothiazolinone-based inhibitors against Staphylococcus aureus sortase A transpeptidase. Bioorg Med Chem 22:5988-6003 (2014)  
Target
Name:
Sortase family protein
Synonyms:
Sortase | Sortase A (SrtA)
Type:
Enzyme
Mol. Mass.:
23546.15
Organism:
Staphylococcus aureus
Description:
Residue:
206
  
Inhibitor
Name:
BDBM50201782
Synonyms:
1-(3,4-dichlorophenyl)-3-(dimethylamino)propan-1-one hydrochloride CHEMBL536752
Type:
Small organic molecule
Emp. Form.:
C11H13Cl2NO
Mol. Mass.:
246.133
SMILES:
CN(C)CCC(=O)c1ccc(Cl)c(Cl)c1
: