Target
Sortase family protein
Ligand
BDBM50030335
Substrate
Meas. Tech.
ChEMBL_1431503 (CHEMBL3389868)
IC50
3800±n/a nM
Citation
 Zhulenkovs, DRudevica, ZJaudzems, KTurks, MLeonchiks, A Discovery and structure-activity relationship studies of irreversible benzisothiazolinone-based inhibitors against Staphylococcus aureus sortase A transpeptidase. Bioorg Med Chem 22:5988-6003 (2014)  
Target
Name:
Sortase family protein
Synonyms:
Sortase | Sortase A (SrtA)
Type:
Enzyme
Mol. Mass.:
23546.15
Organism:
Staphylococcus aureus
Description:
Residue:
206
  
Inhibitor
Name:
BDBM50030335
Synonyms:
CHEMBL3343842
Type:
Small organic molecule
Emp. Form.:
C20H23N3O3S
Mol. Mass.:
385.48
SMILES:
O=C(Cn1sc2ccccc2c1=O)NNC(=O)C12CC3CC(CC(C3)C1)C2
: