Target
D(2) dopamine receptor
Ligand
BDBM50030489
Substrate
Meas. Tech.
ChEMBL_1435675 (CHEMBL3387736)
Ki
18±n/a nM
Citation
 Li, ZHuang, JSun, HZhou, SGuo, LZhou, YZhen, XLiu, H Design, synthesis and evaluation of benzo[a]thieno[3,2-g]quinolizines as novel l-SPD derivatives possessing dopamine D1, D2 and serotonin 5-HT1A multiple action profiles. Bioorg Med Chem 22:5838-46 (2014)  
Target
Name:
D(2) dopamine receptor
Synonyms:
D(2) dopamine receptor DOPAMINE D2 Long DRD2 Dopamine D2 receptor Dopamine D2 receptor (D2R) Dopamine2-like | d2
Type:
Cell-surface receptors
Mol. Mass.:
50647.10
Organism:
Homo sapiens (Human)
Description:
P14416
Residue:
443
  
Inhibitor
Name:
BDBM50030489
Synonyms:
CHEMBL3344468
Type:
Small organic molecule
Emp. Form.:
C19H22ClNO2S
Mol. Mass.:
363.901
SMILES:
[H][C@@]12Cc3sc(CCCCl)cc3CN1CCc1cc(OC)c(O)cc21
: