Target
D(3) dopamine receptor
Ligand
BDBM50030482
Substrate
Meas. Tech.
ChEMBL_1435680 (CHEMBL3387741)
Ki
20±n/a nM
Citation
 Li, ZHuang, JSun, HZhou, SGuo, LZhou, YZhen, XLiu, H Design, synthesis and evaluation of benzo[a]thieno[3,2-g]quinolizines as novel l-SPD derivatives possessing dopamine D1, D2 and serotonin 5-HT1A multiple action profiles. Bioorg Med Chem 22:5838-46 (2014)  
Target
Name:
D(3) dopamine receptor
Synonyms:
DOPAMINE D3 DRD3_HUMAN Dopamine D3 receptor (D3) Dopamine receptor Dopamine receptor D3
Type:
Mol. Mass.:
44243.43
Organism:
Homo sapiens (Human)
Description:
Residue:
400
  
Inhibitor
Name:
BDBM50030482
Synonyms:
CHEMBL3344459
Type:
Small organic molecule
Emp. Form.:
C20H25NO2S
Mol. Mass.:
343.483
SMILES:
[H][C@@]12Cc3sc(CC(C)C)cc3CN1CCc1cc(OC)c(O)cc21
: