Target
3-hydroxy-3-methylglutaryl-coenzyme A reductase
Ligand
BDBM50030652
Substrate
Meas. Tech.
ChEMBL_1437081 (CHEMBL3390812)
IC50
4940±n/a nM
Citation
 Mendieta, AJiménez, FGarduño-Siciliano, LMojica-Villegas, ARosales-Acosta, BVilla-Tanaca, LChamorro-Cevallos, GMedina-Franco, JLMeurice, NGutiérrez, RUMontiel, LECruz, Mdel CTamariz, J Synthesis and highly potent hypolipidemic activity of alpha-asarone- and fibrate-based 2-acyl and 2-alkyl phenols as HMG-CoA reductase inhibitors. Bioorg Med Chem 22:5871-82 (2014)  
Target
Name:
3-hydroxy-3-methylglutaryl-coenzyme A reductase
Synonyms:
3-hydroxy-3-methylglutaryl-coenzyme A (HMG-CoA) reductase HMDH_HUMAN HMG-CoA reductase (HMGR) | HMGCR
Type:
Enzyme
Mol. Mass.:
97477.10
Organism:
Homo sapiens (Human)
Description:
P04035
Residue:
888
  
Inhibitor
Name:
BDBM50030652
Synonyms:
CHEMBL3344536
Type:
Small organic molecule
Emp. Form.:
C11H14O4
Mol. Mass.:
210.2265
SMILES:
CCC(=O)c1cc(OC)c(OC)cc1O
: