Target
Multidrug resistance-associated protein 1
Ligand
BDBM50030672
Substrate
Meas. Tech.
ChEMBL_1437088 (CHEMBL3390819)
EC50
3900±n/a nM
Citation
 Krauze, AGrinberga, SKrasnova, LAdlere, ISokolova, EDomracheva, IShestakova, IAndzans, ZDuburs, G Thieno[2,3-b]pyridines--a new class of multidrug resistance (MDR) modulators. Bioorg Med Chem 22:5860-70 (2014)  
Target
Name:
Multidrug resistance-associated protein 1
Synonyms:
7.6.2.2 ABCC1 ATP-binding cassette, sub-family C, member 1 isoform 1 LTC4 transporter MRP MRP1_HUMAN
Type:
Mol. Mass.:
171597.72
Organism:
Homo sapiens (Human)
Description:
P33527
Residue:
1531
  
Inhibitor
Name:
BDBM50030672
Synonyms:
CHEMBL3342123
Type:
Small organic molecule
Emp. Form.:
C28H28N2O7S
Mol. Mass.:
536.596
SMILES:
COCCOC(=O)c1c(C)nc2sc(C(=O)c3ccccc3)c(N)c2c1-c1cc(OC)c(OC)c(OC)c1
: