Target
Procathepsin L
Ligand
BDBM50030747
Substrate
Meas. Tech.
ChEMBL_1437727 (CHEMBL3382374)
Ki
573±n/a nM
Citation
 Schmitz, JBeckmann, AMDudic, ALi, TSellier, RBartz, UGütschow, M 3-Cyano-3-aza-ß-amino Acid Derivatives as Inhibitors of Human Cysteine Cathepsins. ACS Med Chem Lett 5:1076-81 (2014)  
Target
Name:
Procathepsin L
Synonyms:
CATL1_HUMAN CTSL CTSL1 Cathepsin L Cathepsin L1 heavy chain MEP cathepsin L preproprotein
Type:
Enzyme
Mol. Mass.:
37557.19
Organism:
Homo sapiens (Human)
Description:
Purchased from Calbiochem (San Diego, CA).
Residue:
333
  
Inhibitor
Name:
BDBM50030747
Synonyms:
CHEMBL3342183
Type:
Small organic molecule
Emp. Form.:
C12H20N4O4
Mol. Mass.:
284.3116
SMILES:
CC(C)(C)OC(=O)NN(CC(=O)N1CCOCC1)C#N
: