Target
Cathepsin D
Ligand
BDBM50030745
Substrate
Meas. Tech.
ChEMBL_1437721 (CHEMBL3382368)
Ki
0.001430±n/a nM
Citation
 Schmitz, JBeckmann, AMDudic, ALi, TSellier, RBartz, UGütschow, M 3-Cyano-3-aza-ß-amino Acid Derivatives as Inhibitors of Human Cysteine Cathepsins. ACS Med Chem Lett 5:1076-81 (2014)  
Target
Name:
Cathepsin D
Synonyms:
CATD_HUMAN CTSD Cathepsin D heavy chain Cathepsin D precursor
Type:
Enzyme
Mol. Mass.:
44551.72
Organism:
Homo sapiens (Human)
Description:
Human proCathepsin D (SwissProt accession number P07339) was expressed in Sf9 cells, purified, and autoactivated.
Residue:
412
  
Inhibitor
Name:
BDBM50030745
Synonyms:
CHEMBL3342185 | acs.jmedchem.1c00409_ST.412
Type:
Small organic molecule
Emp. Form.:
C22H26N4O3
Mol. Mass.:
394.4668
SMILES:
CC(C)(C)OC(=O)NN(CC(=O)N(Cc1ccccc1)Cc1ccccc1)C#N
: