Target
ATPase family AAA domain-containing protein 2
Ligand
BDBM50030942
Substrate
Meas. Tech.
ChEMBL_1442444 (CHEMBL3380074)
Kd
350000±n/a nM
Citation
 Harner, MJChauder, BAPhan, JFesik, SW Fragment-based screening of the bromodomain of ATAD2. J Med Chem 57:9687-92 (2014)  
Target
Name:
ATPase family AAA domain-containing protein 2
Synonyms:
AAA nuclear coregulator cancer-associated protein ATAD2 PRO2000
Type:
PROTEIN
Mol. Mass.:
158546.30
Organism:
Homo sapiens (Human)
Description:
ChEMBL_1500426
Residue:
1390
  
Inhibitor
Name:
BDBM50030942
Synonyms:
CHEMBL3356574
Type:
Small organic molecule
Emp. Form.:
C14H12N4
Mol. Mass.:
236.2719
SMILES:
Nc1cccc(c1)-c1n[nH]c(n1)-c1ccccc1
: