Target
Deoxycytidine kinase
Ligand
BDBM50440176
Substrate
Meas. Tech.
ChEMBL_1437136 (CHEMBL3381705)
Ki
0.500000±n/a nM
Citation
 Nomme, JLi, ZGipson, RMWang, JArmijo, ALLe, TPoddar, SSmith, TSantarsiero, BDNguyen, HACzernin, JAlexandrova, ANJung, MERadu, CGLavie, A Structure-guided development of deoxycytidine kinase inhibitors with nanomolar affinity and improved metabolic stability. J Med Chem 57:9480-94 (2014)  
Target
Name:
Deoxycytidine kinase
Synonyms:
DCK | DCK_HUMAN
Type:
PROTEIN
Mol. Mass.:
30510.65
Organism:
Homo sapiens (Human)
Description:
ChEMBL_1437135
Residue:
260
  
Inhibitor
Name:
BDBM50440176
Synonyms:
CHEMBL2426570
Type:
Small organic molecule
Emp. Form.:
C20H25N5O3S2
Mol. Mass.:
447.574
SMILES:
CCCc1sc(nc1CSc1nc(N)cc(N)n1)-c1ccc(OC)c(OCCO)c1
: