Target
Melanocortin receptor 3
Ligand
BDBM50031473
Substrate
Meas. Tech.
ChEMBL_1438566 (CHEMBL3386097)
EC50
0.200000±n/a nM
Citation
 Testa, CScrima, MGrimaldi, MD'Ursi, AMDirain, MLLubin-Germain, NSingh, AHaskell-Luevano, CChorev, MRovero, PPapini, AM 1,4-disubstituted-[1,2,3]triazolyl-containing analogues of MT-II: design, synthesis, conformational analysis, and biological activity. J Med Chem 57:9424-34 (2014)  
Target
Name:
Melanocortin receptor 3
Synonyms:
MC3-R Mc3r
Type:
PROTEIN
Mol. Mass.:
35808.24
Organism:
Mus musculus
Description:
ChEMBL_1498848
Residue:
323
  
Inhibitor
Name:
BDBM50031473
Synonyms:
CHEMBL3358549
Type:
Small organic molecule
Emp. Form.:
C51H69N17O8
Mol. Mass.:
1048.2027
SMILES:
CCCC[C@H](NC(C)=O)C(=O)N[C@H]1CCn2cc(CCC[C@H](NC(=O)[C@H](Cc3c[nH]c4ccccc34)NC(=O)[C@H](CCCNC(N)=N)NC(=O)[C@@H](Cc3ccccc3)NC(=O)[C@H](Cc3cnc[nH]3)NC1=O)C(N)=O)nn2
: