Target
Dihydropteroate synthase
Ligand
BDBM50031524
Substrate
Meas. Tech.
ChEMBL_1440910 (CHEMBL3375174)
Kd
8200±n/a nM
Citation
 Dennis, MLChhabra, SWang, ZCDebono, ADolezal, ONewman, JPitcher, NPRahmani, RCleary, BBarlow, NHattarki, MGraham, BPeat, TSBaell, JBSwarbrick, JD Structure-based design and development of functionalized Mercaptoguanine derivatives as inhibitors of the folate biosynthesis pathway enzyme 6-hydroxymethyl-7,8-dihydropterin pyrophosphokinase from Staphylococcus aureus. J Med Chem 57:9612-26 (2014)  
Target
Name:
Dihydropteroate synthase
Synonyms:
Bacterial dihydropteroate synthase Dihydropteroate synthase folP
Type:
PROTEIN
Mol. Mass.:
30611.24
Organism:
Escherichia coli (strain K12)
Description:
ChEMBL_1440910
Residue:
282
  
Inhibitor
Name:
BDBM50031524
Synonyms:
CHEMBL3233212
Type:
Small organic molecule
Emp. Form.:
C14H13N5O2S
Mol. Mass.:
315.35
SMILES:
CC(Sc1nc2nc(N)[nH]c(=O)c2[nH]1)C(=O)c1ccccc1
: