Target
Dihydropteroate synthase
Ligand
BDBM50031532
Substrate
Meas. Tech.
ChEMBL_1440910 (CHEMBL3375174)
Kd
9740±n/a nM
Citation
 Dennis, MLChhabra, SWang, ZCDebono, ADolezal, ONewman, JPitcher, NPRahmani, RCleary, BBarlow, NHattarki, MGraham, BPeat, TSBaell, JBSwarbrick, JD Structure-based design and development of functionalized Mercaptoguanine derivatives as inhibitors of the folate biosynthesis pathway enzyme 6-hydroxymethyl-7,8-dihydropterin pyrophosphokinase from Staphylococcus aureus. J Med Chem 57:9612-26 (2014)  
Target
Name:
Dihydropteroate synthase
Synonyms:
Bacterial dihydropteroate synthase Dihydropteroate synthase folP
Type:
PROTEIN
Mol. Mass.:
30611.24
Organism:
Escherichia coli (strain K12)
Description:
ChEMBL_1440910
Residue:
282
  
Inhibitor
Name:
BDBM50031532
Synonyms:
CHEMBL3359163
Type:
Small organic molecule
Emp. Form.:
C13H10F3N5OS
Mol. Mass.:
341.312
SMILES:
Nc1nc2[nH]c(SCc3ccccc3C(F)(F)F)nc2c(=O)[nH]1
: