Target
Carbonic anhydrase 9
Ligand
BDBM50031587
Substrate
Meas. Tech.
ChEMBL_1441642 (CHEMBL3377088)
Kd
630±n/a nM
Target
Name:
Carbonic anhydrase 9
Synonyms:
CA-IX CAH9_HUMAN Carbonic anhydrase 9 (CA IX) Carbonic anhydrase 9 precursor Carbonic anhydrase IX (CAIX) Carbonic anhydrases; II & IX MN RCC-associated antigen G250
Type:
Enzyme
Mol. Mass.:
49669.03
Organism:
Homo sapiens (Human)
Description:
Catalytic domain of human cloned isozyme was used in the assay
Residue:
459
  
Inhibitor
Name:
BDBM50031587
Synonyms:
CHEMBL3359180
Type:
Small organic molecule
Emp. Form.:
C26H35F3N2O2S2
Mol. Mass.:
528.694
SMILES:
NS(=O)(=O)c1c(F)c(F)c(SCCc2ccccc2)c(F)c1NC1CCCCCCCCCCC1
: