Target
Carbonic anhydrase 4
Ligand
BDBM50031587
Substrate
Meas. Tech.
ChEMBL_1441636 (CHEMBL3377082)
Kd
>200000±n/a nM
Target
Name:
Carbonic anhydrase 4
Synonyms:
CA-IV CAH4_HUMAN Carbonic anhydrase Carbonic anhydrase IV (CA IV)
Type:
Enzyme
Mol. Mass.:
35037.98
Organism:
Homo sapiens (Human)
Description:
P22748
Residue:
312
  
Inhibitor
Name:
BDBM50031587
Synonyms:
CHEMBL3359180
Type:
Small organic molecule
Emp. Form.:
C26H35F3N2O2S2
Mol. Mass.:
528.694
SMILES:
NS(=O)(=O)c1c(F)c(F)c(SCCc2ccccc2)c(F)c1NC1CCCCCCCCCCC1
: