Target
Carbonic anhydrase 13
Ligand
BDBM50429899
Substrate
Meas. Tech.
ChEMBL_1441659 (CHEMBL3377636)
Kd
<10.0±n/a nM
Target
Name:
Carbonic anhydrase 13
Synonyms:
CA13 Carbonic anhydrase Carbonic anhydrase XIII (CA XIII)
Type:
Enzyme
Mol. Mass.:
29445.78
Organism:
Homo sapiens (Human)
Description:
Q8N1Q1
Residue:
262
  
Inhibitor
Name:
BDBM50429899
Synonyms:
CHEMBL2333416
Type:
Small organic molecule
Emp. Form.:
C8H7F4NO3S2
Mol. Mass.:
305.27
SMILES:
NS(=O)(=O)c1c(F)c(F)c(SCCO)c(F)c1F
: