Target
Carbonic anhydrase 4
Ligand
BDBM50429900
Substrate
Meas. Tech.
ChEMBL_1441636 (CHEMBL3377082)
Kd
160±n/a nM
Target
Name:
Carbonic anhydrase 4
Synonyms:
CA-IV CAH4_HUMAN Carbonic anhydrase Carbonic anhydrase IV (CA IV)
Type:
Enzyme
Mol. Mass.:
35037.98
Organism:
Homo sapiens (Human)
Description:
P22748
Residue:
312
  
Inhibitor
Name:
BDBM50429900
Synonyms:
CHEMBL2333417
Type:
Small organic molecule
Emp. Form.:
C8H7F4NO5S2
Mol. Mass.:
337.268
SMILES:
NS(=O)(=O)c1c(F)c(F)c(c(F)c1F)S(=O)(=O)CCO
: