Target
Caspase-3
Ligand
BDBM50031611
Substrate
Meas. Tech.
ChEMBL_1441661 (CHEMBL3377638)
IC50
41±n/a nM
Citation
 Limpachayaporn, PWagner, SKopka, KSchober, OSchäfers, MHaufe, G Synthesis of 7-halogenated isatin sulfonamides: nonradioactive counterparts of caspase-3/-7 inhibitor-based potential radiopharmaceuticals for molecular imaging of apoptosis. J Med Chem 57:9383-95 (2014)  
Target
Name:
Caspase-3
Synonyms:
Apopain CASP3 CPP-32 Caspase 3 Caspase-3 subunit p17 SCA-1 Yama protein | caspase-3 preproprotein
Type:
Hydrolase; heterotetramer of two heterodimers
Mol. Mass.:
31607.55
Organism:
Homo sapiens (Human)
Description:
Residue:
277
  
Inhibitor
Name:
BDBM50031611
Synonyms:
CHEMBL3359203
Type:
Small organic molecule
Emp. Form.:
C17H20F2N2O5S
Mol. Mass.:
402.413
SMILES:
COC[C@@H]1CCCN1S(=O)(=O)c1cc2C(=O)C(=O)N(CCCF)c2c(F)c1
: