Target
Renin
Ligand
BDBM50031613
Substrate
Meas. Tech.
ChEMBL_1442514 (CHEMBL3371638)
IC50
>1000±n/a nM
Citation
 Dineen, TAChen, KCheng, ACDerakhchan, KEpstein, OEsmay, JHickman, DKreiman, CEMarx, IEWahl, RCWen, PHWeiss, MMWhittington, DAWood, SFremeau, RTWhite, RDPatel, VF Inhibitors of฿-site amyloid precursor protein cleaving enzyme (BACE1): identification of (S)-7-(2-fluoropyridin-3-yl)-3-((3-methyloxetan-3-yl)ethynyl)-5'H-spiro[chromeno[2,3-b]pyridine-5,4'-oxazol]-2'-amine (AMG-8718). J Med Chem 57:9811-31 (2014)  
Target
Name:
Renin
Synonyms:
Angiotensinogenase RENI_HUMAN
Type:
Enzyme
Mol. Mass.:
45058.99
Organism:
Homo sapiens (Human)
Description:
Residue:
406
  
Inhibitor
Name:
BDBM50031613
Synonyms:
CHEMBL3359763
Type:
Small organic molecule
Emp. Form.:
C25H19FN4O3
Mol. Mass.:
442.4418
SMILES:
CC1(COC1)C#Cc1cnc2Oc3ccc(cc3[C@@]3(COC(N)=N3)c2c1)-c1cccnc1F
: