Target
Histone deacetylase 6
Ligand
BDBM50032270
Substrate
Meas. Tech.
ChEMBL_1440128 (CHEMBL3382541)
Ki
1900±n/a nM
Citation
 Maolanon, ARVilladsen, JSChristensen, NJHoeck, CFriis, THarris, PGotfredsen, CHFristrup, POlsen, CA Methyl effect in azumamides provides insight into histone deacetylase inhibition by macrocycles. J Med Chem 57:9644-57 (2014)  
Target
Name:
Histone deacetylase 6
Synonyms:
Cereblon/Histone deacetylase 6 HDAC6 Histone deacetylase 6 (HDAC6) KIAA0901 | ORF Names:JM21
Type:
Chromatin regulator; hydrolase; repressor
Mol. Mass.:
131381.51
Organism:
Homo sapiens (Human)
Description:
Q9UBN7
Residue:
1215
  
Inhibitor
Name:
BDBM50032270
Synonyms:
CHEMBL3352995
Type:
Small organic molecule
Emp. Form.:
C28H39N5O6
Mol. Mass.:
541.6392
SMILES:
CC(C)[C@H]1NC(=O)C[C@@H](CCCCCC(O)=O)NC(=O)[C@@H](Cc2c[nH]c3ccccc23)NC(=O)[C@@H](C)NC1=O
: