Target
Free fatty acid receptor 2
Ligand
BDBM50032332
Substrate
Meas. Tech.
ChEMBL_1440135 (CHEMBL3382548)
IC50
>10000±n/a nM
Citation
 Pizzonero, MDupont, SBabel, MBeaumont, SBienvenu, NBlanqué, RCherel, LChristophe, TCrescenzi, BDe Lemos, EDelerive, PDeprez, PDe Vos, SDjata, FFletcher, SKopiejewski, SL'Ebraly, CLefrançois, JMLavazais, SManioc, MNelles, LOste, LPolancec, DQuénéhen, VSoulas, FTriballeau, Nvan der Aar, EMVandeghinste, NWakselman, EBrys, RSaniere, L Discovery and optimization of an azetidine chemical series as a free fatty acid receptor 2 (FFA2) antagonist: from hit to clinic. J Med Chem 57:10044-57 (2014)  
Target
Name:
Free fatty acid receptor 2
Synonyms:
FFA2 FFAR2_HUMAN GPCR43 | GPR43
Type:
PROTEIN
Mol. Mass.:
37156.44
Organism:
Homo sapiens (Human)
Description:
ChEMBL_1508993
Residue:
330
  
Inhibitor
Name:
BDBM50032332
Synonyms:
CHEMBL3353507
Type:
Small organic molecule
Emp. Form.:
C19H22N2O4S
Mol. Mass.:
374.454
SMILES:
CN(CCCC(O)=O)C(=O)C1(C)CCN1C(=O)c1csc2ccccc12
: