Target
Cyclin-dependent kinase 2
Ligand
BDBM50032626
Substrate
Meas. Tech.
ChEMBL_1440958 (CHEMBL3375808)
IC50
80±n/a nM
Citation
 Hanan, EJEigenbrot, CBryan, MCBurdick, DJChan, BKChen, YDotson, JHeald, RAJackson, PSLa, HLainchbury, MDMalek, SPurkey, HESchaefer, GSchmidt, SSeward, EMSideris, STam, CWang, SYeap, SKYen, IYin, JYu, CZilberleyb, IHeffron, TP Discovery of selective and noncovalent diaminopyrimidine-based inhibitors of epidermal growth factor receptor containing the T790M resistance mutation. J Med Chem 57:10176-91 (2014)  
Target
Name:
Cyclin-dependent kinase 2
Synonyms:
CDK2 CDK2_HUMAN Cell division protein kinase 2 Protein cereblon/Cyclin-dependent kinase 2 | p33 protein kinase
Type:
Enzyme Subunit
Mol. Mass.:
33938.17
Organism:
Homo sapiens (Human)
Description:
P24941
Residue:
298
  
Inhibitor
Name:
BDBM50032626
Synonyms:
CHEMBL3354188
Type:
Small organic molecule
Emp. Form.:
C20H26N6O
Mol. Mass.:
366.46
SMILES:
COC1CCN(CC1)c1nccc(Nc2cc3n(ccc3cn2)C(C)C)n1
: