Target
Non-receptor tyrosine-protein kinase TYK2
Ligand
BDBM50032628
Substrate
Meas. Tech.
ChEMBL_1440960 (CHEMBL3375810)
Ki
>1000±n/a nM
Citation
 Hanan, EJEigenbrot, CBryan, MCBurdick, DJChan, BKChen, YDotson, JHeald, RAJackson, PSLa, HLainchbury, MDMalek, SPurkey, HESchaefer, GSchmidt, SSeward, EMSideris, STam, CWang, SYeap, SKYen, IYin, JYu, CZilberleyb, IHeffron, TP Discovery of selective and noncovalent diaminopyrimidine-based inhibitors of epidermal growth factor receptor containing the T790M resistance mutation. J Med Chem 57:10176-91 (2014)  
Target
Name:
Non-receptor tyrosine-protein kinase TYK2
Synonyms:
Non-receptor tyrosine-protein kinase TYK2 (TYK2) TYK2_HUMAN | Tyrosine-protein kinase TYK2
Type:
Protein
Mol. Mass.:
133666.03
Organism:
Homo sapiens (Human)
Description:
P29597
Residue:
1187
  
Inhibitor
Name:
BDBM50032628
Synonyms:
CHEMBL3354190
Type:
Small organic molecule
Emp. Form.:
C19H25N7O
Mol. Mass.:
367.4481
SMILES:
COC1CCN(CC1)c1nccc(Nc2cc3n(cnc3cn2)C(C)C)n1
: