Target
Epidermal growth factor receptor
Ligand
BDBM50032626
Substrate
Meas. Tech.
ChEMBL_1440951 (CHEMBL3375801)
Ki
1100±n/a nM
Citation
 Hanan, EJEigenbrot, CBryan, MCBurdick, DJChan, BKChen, YDotson, JHeald, RAJackson, PSLa, HLainchbury, MDMalek, SPurkey, HESchaefer, GSchmidt, SSeward, EMSideris, STam, CWang, SYeap, SKYen, IYin, JYu, CZilberleyb, IHeffron, TP Discovery of selective and noncovalent diaminopyrimidine-based inhibitors of epidermal growth factor receptor containing the T790M resistance mutation. J Med Chem 57:10176-91 (2014)  
Target
Name:
Epidermal growth factor receptor
Synonyms:
EGF Receptor Substrate EGFR_HUMAN ERBB1 Epidermal Growth Factor Receptor erbB-1 Epidermal growth factor receptor (EGFR) HER1 Proto-oncogene c-ErbB-1 Tyrosine-Protein Kinase ErbB-1
Type:
Receptor Kinase Domain
Mol. Mass.:
134279.59
Organism:
Homo sapiens (Human)
Description:
P00533
Residue:
1210
  
Inhibitor
Name:
BDBM50032626
Synonyms:
CHEMBL3354188
Type:
Small organic molecule
Emp. Form.:
C20H26N6O
Mol. Mass.:
366.46
SMILES:
COC1CCN(CC1)c1nccc(Nc2cc3n(ccc3cn2)C(C)C)n1
: