Target
Transmembrane protease serine 6
Ligand
BDBM50032700
Substrate
Meas. Tech.
ChEMBL_1442547 (CHEMBL3371671)
Ki
15±n/a nM
Citation
 Duchêne, DColombo, EDésilets, ABoudreault, PLLeduc, RMarsault, ENajmanovich, R Analysis of subpocket selectivity and identification of potent selective inhibitors for matriptase and matriptase-2. J Med Chem 57:10198-204 (2014)  
Target
Name:
Transmembrane protease serine 6
Synonyms:
Matriptase-2 TMPS6_HUMAN
Type:
PROTEIN
Mol. Mass.:
90001.12
Organism:
Homo sapiens (Human)
Description:
ChEMBL_1442547
Residue:
811
  
Inhibitor
Name:
BDBM50032700
Synonyms:
CHEMBL3354678
Type:
Small organic molecule
Emp. Form.:
C28H46N14O4S
Mol. Mass.:
674.821
SMILES:
C[C@H](NC(=O)[C@H](CCCNC(N)=N)NC(=O)[C@@H](N)CCCNC(N)=N)C(=O)N[C@@H](CCCNC(N)=N)C(=O)c1nc2ccccc2s1
: