Target
Transmembrane protease serine 6
Ligand
BDBM50032706
Substrate
Meas. Tech.
ChEMBL_1442547 (CHEMBL3371671)
Ki
1.0±n/a nM
Citation
 Duchêne, DColombo, EDésilets, ABoudreault, PLLeduc, RMarsault, ENajmanovich, R Analysis of subpocket selectivity and identification of potent selective inhibitors for matriptase and matriptase-2. J Med Chem 57:10198-204 (2014)  
Target
Name:
Transmembrane protease serine 6
Synonyms:
Matriptase-2 TMPS6_HUMAN
Type:
PROTEIN
Mol. Mass.:
90001.12
Organism:
Homo sapiens (Human)
Description:
ChEMBL_1442547
Residue:
811
  
Inhibitor
Name:
BDBM50032706
Synonyms:
CHEMBL3354683
Type:
Small organic molecule
Emp. Form.:
C36H41N9O5S2
Mol. Mass.:
743.898
SMILES:
N[C@@H](Cc1c[nH]c2ccccc12)C(=O)N[C@@H](CS)C(=O)N[C@@H](Cc1ccc(O)cc1)C(=O)N[C@@H](CCCNC(N)=N)C(=O)c1nc2ccccc2s1
: