Target
Beta-secretase 1
Ligand
BDBM50032743
Substrate
Meas. Tech.
ChEMBL_1442550 (CHEMBL3371674)
IC50
71±n/a nM
Citation
 Epstein, OBryan, MCCheng, ACDerakhchan, KDineen, TAHickman, DHua, ZHuman, JBKreiman, CMarx, IEWeiss, MMWahl, RCWen, PHWhittington, DAWood, SZheng, XMFremeau, RTWhite, RDPatel, VF Lead optimization and modulation of hERG activity in a series of aminooxazoline xantheneß-site amyloid precursor protein cleaving enzyme (BACE1) inhibitors. J Med Chem 57:9796-810 (2014)  
Target
Name:
Beta-secretase 1
Synonyms:
ASP2 Aspartyl protease 2 BACE1 Beta-secretase (BACE) Beta-secretase 1 (BACE 1) Beta-secretase 1 (BACE1) Beta-site amyloid precursor protein cleaving enzyme 1 Memapsin-2 beta-Secretase (BACE-1) | beta-Secretase (BACE1)
Type:
Protein
Mol. Mass.:
55755.10
Organism:
Homo sapiens (Human)
Description:
P56817
Residue:
501
  
Inhibitor
Name:
BDBM50032743
Synonyms:
CHEMBL3354714
Type:
Small organic molecule
Emp. Form.:
C25H22FN3O4
Mol. Mass.:
447.4583
SMILES:
CC1(COc2ccc3Oc4c(F)cc(cc4[C@@]4(COC(N)=N4)c3c2)-c2cccnc2)COC1
: