Target
Neutrophil elastase
Ligand
BDBM50032888
Substrate
Meas. Tech.
ChEMBL_1431796 (CHEMBL3385092)
EC50
4.0±n/a nM
Citation
 Abdel-Magid, AF Neutrophil elastase inhibitors as potential anti-inflammatory therapies. ACS Med Chem Lett 5:1182-3 (2014)  
Target
Name:
Neutrophil elastase
Synonyms:
Bone marrow serine protease Coagulation factor X ELANE Elastase HLE Leukocyte elastase Medullasin Neutrophil elastase (HNE) PMN elastase Trypsin
Type:
Enzyme
Mol. Mass.:
28532.38
Organism:
Homo sapiens (Human)
Description:
P08246
Residue:
267
  
Inhibitor
Name:
BDBM50032888
Synonyms:
CHEMBL3342778 US9670166, 6.3
Type:
Small organic molecule
Emp. Form.:
C26H21F3N4O3
Mol. Mass.:
494.4651
SMILES:
FC(F)(F)c1cccc(c1)N1C2=C(C(N(CC(=O)N3CCC3)C1=O)c1ccc(cc1)C#N)C(=O)CC2
: