Target
Serine protease hepsin
Ligand
BDBM50032945
Substrate
Meas. Tech.
ChEMBL_1432692 (CHEMBL3389936)
Ki
0.610000±n/a nM
Citation
 Han, ZHarris, PKJones, DEChugani, RKim, TAgarwal, MShen, WWildman, SAJanetka, JW Inhibitors of HGFA, Matriptase, and Hepsin Serine Proteases: A Nonkinase Strategy to Block Cell Signaling in Cancer. ACS Med Chem Lett 5:1219-24 (2014)  
Target
Name:
Serine protease hepsin
Synonyms:
HEPS_HUMAN Hepsin TMPRSS1 Transmembrane protease, serine 1
Type:
Enzyme
Mol. Mass.:
45016.98
Organism:
Homo sapiens (Human)
Description:
Human deglycosylated hepsin was expressed in Pichia pastoris.
Residue:
417
  
Inhibitor
Name:
BDBM50032945
Synonyms:
CHEMBL3356604
Type:
Small organic molecule
Emp. Form.:
C27H47N9O6S
Mol. Mass.:
625.784
SMILES:
CC(C)C[C@H](NC(=O)[C@H](CCCCN)NC(=O)[C@@H](NC(C)=O)[C@@H](C)O)C(=O)N[C@@H](CCCNC(N)=N)C(=O)c1nccs1
: