Target
Signal transducer and activator of transcription 5B
Ligand
BDBM50033944
Substrate
Meas. Tech.
ChEMBL_1436463 (CHEMBL3390778)
Ki
4770±n/a nM
Citation
 Cumaraswamy, AALewis, AMGeletu, MTodic, ADiaz, DBCheng, XRBrown, CELaister, RCMuench, DKerman, KGrimes, HLMinden, MDGunning, PT Nanomolar-Potency Small Molecule Inhibitor of STAT5 Protein. ACS Med Chem Lett 5:1202-1206 (2014)  
Target
Name:
Signal transducer and activator of transcription 5B
Synonyms:
STA5B_HUMAN Signal transducer and activator of transcription 5B | Transcription factor STAT5b (STAT5b)
Type:
Protein
Mol. Mass.:
89858.26
Organism:
Homo sapiens (Human)
Description:
Residue:
787
  
Inhibitor
Name:
BDBM50033944
Synonyms:
CHEMBL3358598
Type:
Small organic molecule
Emp. Form.:
C34H44N2O6S
Mol. Mass.:
608.788
SMILES:
CN(CC(=O)N(Cc1cc(cc(c1)C(C)(C)C)C(C)(C)C)c1ccc(C(O)=O)c(O)c1)S(=O)(=O)c1c(C)cc(C)cc1C
: