Target
Sigma non-opioid intracellular receptor 1
Ligand
BDBM50034095
Substrate
Meas. Tech.
ChEMBL_1437207 (CHEMBL3382981)
Ki
17±n/a nM
Citation
 Lan, YChen, YCao, XZhang, JWang, JXu, XQiu, YZhang, TLiu, XLiu, BFZhang, G Synthesis and biological evaluation of novel sigma-1 receptor antagonists based on pyrimidine scaffold as agents for treating neuropathic pain. J Med Chem 57:10404-23 (2014)  
Target
Name:
Sigma non-opioid intracellular receptor 1
Synonyms:
OPRS1 SIGMAR1 Sigma non-opioid intracellular receptor 1 Sigma1-receptor Sterol isomerase-like protein
Type:
Protein
Mol. Mass.:
25307.17
Organism:
Cavia porcellus (Guinea pig)
Description:
Q60492
Residue:
223
  
Inhibitor
Name:
BDBM50034095
Synonyms:
CHEMBL3358641
Type:
Small organic molecule
Emp. Form.:
C20H27N3O
Mol. Mass.:
325.4479
SMILES:
CC1CCN(CCCOc2cc(C)nc(n2)-c2ccccc2)CC1
: