Target
Sigma non-opioid intracellular receptor 1
Ligand
BDBM50034106
Substrate
Meas. Tech.
ChEMBL_1437207 (CHEMBL3382981)
Ki
40±n/a nM
Citation
 Lan, YChen, YCao, XZhang, JWang, JXu, XQiu, YZhang, TLiu, XLiu, BFZhang, G Synthesis and biological evaluation of novel sigma-1 receptor antagonists based on pyrimidine scaffold as agents for treating neuropathic pain. J Med Chem 57:10404-23 (2014)  
Target
Name:
Sigma non-opioid intracellular receptor 1
Synonyms:
OPRS1 SIGMAR1 Sigma non-opioid intracellular receptor 1 Sigma1-receptor Sterol isomerase-like protein
Type:
Protein
Mol. Mass.:
25307.17
Organism:
Cavia porcellus (Guinea pig)
Description:
Q60492
Residue:
223
  
Inhibitor
Name:
BDBM50034106
Synonyms:
CHEMBL3359244
Type:
Small organic molecule
Emp. Form.:
C16H24ClN3O
Mol. Mass.:
309.834
SMILES:
Cc1nc(nc(OCCCN2CCCCC2)c1Cl)C1CC1
: