Target
cGMP-specific 3',5'-cyclic phosphodiesterase
Ligand
BDBM50034647
Substrate
Meas. Tech.
ChEMBL_1440219 (CHEMBL3383764)
IC50
141±n/a nM
Citation
 Shao, YXHuang, MCui, WFeng, LJWu, YCai, YLi, ZZhu, XLiu, PWan, YKe, HLuo, HB Discovery of a phosphodiesterase 9A inhibitor as a potential hypoglycemic agent. J Med Chem 57:10304-13 (2014)  
Target
Name:
cGMP-specific 3',5'-cyclic phosphodiesterase
Synonyms:
3',5'-cyclic phosphodiesterase PDE5 PDE5A_HUMAN Phosphodiesterase 5 (PDE5) Phosphodiesterase 5A (PDE5A) cGMP-specific 3',5'-cyclic phosphodiesterase
Type:
Protein
Mol. Mass.:
99975.83
Organism:
Homo sapiens (Human)
Description:
O76074
Residue:
875
  
Inhibitor
Name:
BDBM50034647
Synonyms:
CHEMBL3360412
Type:
Small organic molecule
Emp. Form.:
C21H19ClN6O3
Mol. Mass.:
438.867
SMILES:
COc1ccc(NC(=O)[C@@H](C)Nc2nc3n(ncc3c(=O)[nH]2)-c2ccccc2Cl)cc1
: