Target
Muscarinic acetylcholine receptor M1
Ligand
BDBM50034774
Substrate
Meas. Tech.
ChEMBL_1441013 (CHEMBL3376443)
EC50
845±n/a nM
Citation
 Han, CChatterjee, ANoetzel, MJPanarese, JDSmith, EChase, PHodder, PNiswender, CConn, PJLindsley, CWStauffer, SR Discovery and SAR of muscarinic receptor subtype 1 (M1) allosteric activators from a molecular libraries high throughput screen. Part 1: 2,5-dibenzyl-2H-pyrazolo[4,3-c]quinolin-3(5H)-ones as positive allosteric modulators. Bioorg Med Chem Lett 25:384-8 (2014)  
Target
Name:
Muscarinic acetylcholine receptor M1
Synonyms:
ACM1_HUMAN Cholinergic receptor, muscarinic 1 | Cholinergic, muscarinic M1
Type:
Protein
Mol. Mass.:
51442.54
Organism:
Homo sapiens (Human)
Description:
P11229
Residue:
460
  
Inhibitor
Name:
BDBM50034774
Synonyms:
CHEMBL3360927
Type:
Small organic molecule
Emp. Form.:
C24H20F2N6O4S
Mol. Mass.:
526.515
SMILES:
Cc1cc(NC(=O)CS(=O)(=O)c2cn(Cc3ccc(nc3)-c3cnn(C)c3)c3cc(F)cc(F)c23)no1
: