Target
Oxysterols receptor LXR-beta
Ligand
BDBM50034790
Substrate
Meas. Tech.
ChEMBL_1441019 (CHEMBL3377015)
EC50
20±n/a nM
Citation
 Kick, EMartin, RXie, YFlatt, BSchweiger, EWang, TLBusch, BNyman, MGu, XHYan, GWagner, BNanao, MNguyen, LStout, TPlonowski, ASchulman, IOstrowski, JKirchgessner, TWexler, RMohan, R Liver X receptor (LXR) partial agonists: biaryl pyrazoles and imidazoles displaying a preference for LXRß. Bioorg Med Chem Lett 25:372-7 (2014)  
Target
Name:
Oxysterols receptor LXR-beta
Synonyms:
LXRB Liver X, LXR beta NR1H2 Nuclear receptor NER Ubiquitously-expressed nuclear receptor
Type:
Enzyme Catalytic Domain
Mol. Mass.:
50978.79
Organism:
Homo sapiens (Human)
Description:
P55055
Residue:
460
  
Inhibitor
Name:
BDBM50034790
Synonyms:
CHEMBL3360961
Type:
Small organic molecule
Emp. Form.:
C26H15F5N2O2
Mol. Mass.:
482.4015
SMILES:
Fc1ccc(Cn2c(cc(c(C#N)c2=O)C(F)(F)F)-c2ccc(Oc3ccccc3)cc2)c(F)c1
: